Alpinismo
type: Concept
preferred label: Bergsteigen @de
preferred label: alpinismo (montañismo) @es
preferred label: Alpinisme et escalade @fr
preferred label: alpinismo @pt-br
preferred label: climbing @en-gb
preferred label: クライミング @ja-jp
definition: Escalar montanhas com equipamento próprio. @pt-br
definition: sports de montagne @fr
definition: Sports alpini consistenti in arrampicate e scalate di pareti di roccia e/o ghiaccio
definition: Bergsportart @de
definition: 山のスポーツ @ja-jp
definition: Escalamiento de una montaña con implementos especiales @es
definition: mountain sports @en-gb
note: nessuno
in scheme: subjectcode
created: 2000-10-30T12:00:00+00:00
modified: 2010-12-15T17:01:09+00:00
broader: http://cv.iptc.org/newscodes/subjectcode/15000000
narrower: http://cv.iptc.org/newscodes/subjectcode/15016001
narrower: http://cv.iptc.org/newscodes/subjectcode/15016002