Pista
type: Concept
preferred label: pista @es
preferred label: piste @fr
preferred label: track @en-gb
preferred label: Bahnradsport @de
preferred label: トラック @ja-jp
definition: Corrida de bicicleta em pista de velódromo. @pt-pt
definition: Ein Rennen auf einer Strecke in einem Velodrom. @de
definition: course se déroulant sur une piste de vélodrome @fr
definition: Una carrera de velocidad en pista de velódromo @es
definition: 競輪場内のトラックで行われるレース @ja-jp
definition: A race staged on a track in a velodrome @en-gb
definition: Una corsa tenuta sulle piste di un velodromo
note: nessuno
in scheme: subjectcode
created: 2000-10-30T12:00:00+00:00
modified: 2010-12-15T17:01:09+00:00
broader: http://cv.iptc.org/newscodes/subjectcode/15019000