sprint olímpico
type: Concept
preferred label: チームスプリント @ja-jp
preferred label: Sprint Olympique @fr
preferred label: Olympischer Sprint @de
preferred label: carrera olímpica @es
preferred label: Sprint olimpico @it
preferred label: Olympic sprint @en-gb
definition: Corrida de classificação de 200m. A partir dos quartos-de-final, dois ciclistas seguem lado a lado. A prova por equipas disputa-se com 3 ciclistas por país.
definition: Un tour de qualification se fait au temps sur 200 m. A partir des quarts de finale, matches à 2 en deux manches gagnantes. Par équipes, l'épreuve se déroule avec 3 sprinteurs par pays qui s'effacent l'un après l'autre à la fin de chaque tour. @fr
definition: Qualifikationsrennen über 200 m. Nach dem Viertel-Finale starten zwei Radfahrer Kopf an Kopf. Bei Mannschaftsrennen bestehend aus drei Radfahrern aus unterschiedlichen Ländern. @de
definition: 予選は200m超で行われる。準々決勝からは2人が並んで行う。チームによっては異なった国からの3人の自転車選手によって競技を行う @ja-jp
definition: Corsa di qualificazione tenuta sui 200 m @it
definition: Qualifying race held over 200m. From the quarter-finals two cyclists go head-to-heads. By teams races consist of three cyclists from different countries. @en-gb
definition: Corrida de classificação de 200m. A partir das quartas de final, dois ciclistas seguem lado a lado. A prova por equipes se disputa com 3 ciclistas por país.
definition: Carrera de clasificación en competencia olímpica sostenida sobre 200 metros. Desde los cuartos de final dos ciclistas van mano a mano, mientras que por equipos la carrera consiste en tres ciclistas de distintos países. @es
note: nessuno @it
in scheme: subjectcode
created: 2000-10-30T12:00:00+00:00
modified: 2010-12-15T17:01:09+00:00
broader: http://cv.iptc.org/newscodes/subjectcode/15019000