競輪
type: Concept
preferred label: keirin @es
preferred label: Keirin @pt-pt
definition: Sprint between six cyclists where a pacemaker on a moped gradually increases the pace over the first 1400m. When the pacemaker leaves the track the race develops into a sprint finish over the final 6-700m. @en-gb
definition: Sprint zwischen sechs Radfahrern, bei dem ein Tempomacher auf einem Moped das Tempo über die ersten 1400 m beschleunigt. Wenn der Tempomacher die Bahn verlässt, entwickelt sich das Rennen zu einem Endspurt über die letzten 6-700 Meter. @de
definition: *Corrida de velocidade de 6 ciclistas em pista de velódromo. Os ciclistas seguem atrás de um motociclista que aumenta gradualmente a velocidade nos primeiros 1400 m. Quando ele abandona a pista, ocorre o **sprint** final.* @pt-pt
definition: Gara tra sei ciclisti dove un motociclo aumenta gradualmente la velocità e l'andatura lungo i primi 1400 metri. Quando il motociclo lascia la pista, la corsa prosegue con uno scatto finale negli ultimi 6-700 m @it
definition: 6選手で行われるスプリントで、最初の1400mで、モペットに乗ったペースメーカーがペースを徐々にあげていく。ペースメーカーが待避した後、最後の600～700メートルで勝負が決まる
definition: Embalaje entre seis ciclistas donde uno marca el paso e incrementa gradualmente la velocidad en los primeros 1.400 metros. Cuando el que marca el paso sale de pista la carrera se desarrolla en un embalaje final de 600 a 700 metros. @es
definition: Sprint à 6 : Lors des premiers 1400 mètres, l'allure des coureurs est réglée par un entraîneur sur un engin à propulsion électrique. Celui-ci accélère progressivement et quitte la piste à 6-700 mètres de l'arrivée. @fr
note: nessuno @it
in scheme: subjectcode
created: 2000-10-30T12:00:00+00:00
modified: 2010-12-15T17:01:09+00:00
broader: http://cv.iptc.org/newscodes/subjectcode/15019000