Strada
type: Concept
preferred label: ロードレース @ja-jp
preferred label: ciclismo de estrada @pt-br
preferred label: prueba de ruta @es
preferred label: Course en ligne @fr
preferred label: road race @en-gb
preferred label: Straßenrennen @de
definition: Road race with all the competitor starting en masse. @en-gb
definition: course sur route avec les coureurs partant tous ensemble @fr
definition: Corrida de estrada em que os ciclistas partem todos ao mesmo tempo. @pt-pt
definition: Corsa su strada con tutti i concorrenti fatti partire insieme
definition: 全選手が一斉にスタートするレース @ja-jp
definition: Straßenrennen bei dem alle Wettkämpfer in der Masse starten. @de
definition: Todos los ciclistas largan en masa (pelotón) a la ruta. @es
note: nessuno
in scheme: subjectcode
created: 2000-10-30T12:00:00+00:00
modified: 2010-12-15T17:01:09+00:00
broader: http://cv.iptc.org/newscodes/subjectcode/15019000