Ciclocross
type: Concept
preferred label: ciclocrosse @pt-br
preferred label: cyclo-cross @en-gb
preferred label: ciclocross @es
preferred label: シクロクロス @ja-jp
preferred label: Querfeldein/Cross @de
definition: 土、草地、砂地、舗装道路等の様々な路面状況が舞台の競技 @ja-jp
definition: Ciclismo praticado por etapas em várias superfícies (terra, lama, areia e estrada), com obstáculos naturais ou artificiais. @pt-pt
definition: Ausgetragen auf unterschiedlichen Oerflächen - Erde, Grass, Sand oder Asphalt. @de
definition: Ciclismo por etapas sobre varias superficies: tierra, pasto, arena o sintético. @es
definition: Staged on various surfaces - earth, grass, sand or tarmac. @en-gb
definition: Corsa disputata su un suolo accidentato e su superfici diverse
definition: Le cyclo-cross se pratique sur un sol accidenté et des surfaces diverses (terre, herbe, sable, macadam). @fr
note: nessuno
in scheme: subjectcode
created: 2000-10-30T12:00:00+00:00
modified: 2010-12-15T17:01:09+00:00
broader: http://cv.iptc.org/newscodes/subjectcode/15019000