BTT-cross
type: Concept
preferred label: vtt-cross @es
preferred label: クロスカントリー @ja-jp
preferred label: Vtt-cross @en-gb
preferred label: MTB-cross
preferred label: Vtt cross @fr
preferred label: Mountain bike cross @it
preferred label: Mountainbike-Cross @de
definition: Una corsa di resistenza su biciclette da montagna con un circuito di 10 km su vari terreni e con vari gradi di pendenze. @it
definition: discipline d'endurance sur circuits d'une longueur par boucle de près de 10 km avec un dénivelée allant jusqu'à 400 m aux 10 km. Le coureur effectue le parcours sans aucune aide extérieure @fr
definition: An endurance race on mountain bikes around a 10km circuit over various terrain and with different degrees of slopes. Competitors are not allowed any exterior help. @en-gb
definition: Una carrera de resistencia en bicicletas montaña en un circuito de 10 km sobre superficies varias y con subidas con distintos grados. Los competidores no tienen permitida ayuda externa. @es
definition: Corrida de resistência em bicicletas de montanha em circuito de 10 km, sobre superfícies variadas, com descidas e subidas de diferentes graus de inclinação e de dificuldade. Os participantes não podem ter ajuda externa.
definition: 一周10ｋｍ以上の変化に富んだ傾斜と起伏のサーキットをまわるマウンテンバイクの耐久レース。出場者は一切の支援を受けられない @ja-jp
definition: Ausdauerrennen auf Mountainbikes über eine 10 km Strecke in unterschiedlichem Gelände und verschiedenen Steigungsgraden. Wettkämpfer dürfen keine Hilfe von außen annehmen. @de
definition: Corrida de resistência em bicicletas todo o terreno num circuito de 10 km, sobre superfícies variadas, com descidas e subidas de diferentes graus de inclinação e de dificuldade. Os participantes não podem ter ajuda externa.
note: nessuno @it
note: typo fixed in Explanation @en-gb
in scheme: subjectcode
created: 2000-10-30T12:00:00+00:00
modified: 2010-12-15T17:01:09+00:00
broader: http://cv.iptc.org/newscodes/subjectcode/15019000
broad match: http://cv.iptc.org/newscodes/mediatopic/20000903