Danza
type: Concept
preferred label: Danse sportive @fr
preferred label: danza @es
preferred label: dancing @en-gb
preferred label: Tanzen @de
preferred label: dança rítmica @pt-pt
preferred label: ダンス @ja-jp
definition: Tanzwettbewerb, wo Paare in Technik und Interpretation bewertet werden. @de
definition: Dancing competition where couples are judged on technique and interpretation. @en-gb
definition: Competencia de danza donde las parejas son juzgadas por su técnica e interpretación. @es
definition: Competizione di danza in cui delle coppie sono giudicate sulla loro tecnica e interpretazione
definition: カップルのテクニックと演技力を審査する競技 @ja-jp
definition: concours de danse où les couples sont jugés sur le plan technique et de l'interprétation @fr
definition: Competição de dança em que os pares são julgados pela técnica e pela interpretação. @pt-pt
note: nessuno
in scheme: subjectcode
created: 2000-10-30T12:00:00+00:00
modified: 2010-12-15T17:01:09+00:00
broader: http://cv.iptc.org/newscodes/subjectcode/15000000