Tre Giorni
type: Concept
preferred label: 総合馬術 @ja-jp
preferred label: Concours complet @fr
preferred label: concurso completo de equitação (CCE) @pt-br
preferred label: Vielseitigkeit @de
preferred label: three-day event @en-gb
preferred label: evento de tres días-completo @es
definition: Deporte ecuestre que incluye tres disciplinas: adiestramiento, salto y cross-country (como prueba de fondo). @es
definition: Evento equestre envolvendo três disciplinas: adestramento, cross-country e concurso de saltos. @pt-br
definition: 馬場馬術、クロスカントリー、および障害飛越の3つの規律にかかわる馬術競技 @ja-jp
definition: Competizione equestre con tre discipline nell'arco di tre giorni
definition: compétition qui combine 3 épreuves se déroulant sur 3 jours (Dressage, endurance et concours hippique) @fr
definition: Evento equestre envolvendo três disciplinas: dressage, cross-country e concurso de saltos. @pt-pt
definition: Equestrian event involving three disciplines - Dressage, cross-country and show jumping. @en-gb
definition: Pferdesport-Ereignis mit drei Disziplinen - Dressur, Geländeritt und Springen. @de
note: nessuno
in scheme: subjectcode
created: 2000-10-30T12:00:00+00:00
modified: 2010-12-15T17:01:09+00:00
broader: http://cv.iptc.org/newscodes/subjectcode/15022000