Spada
type: Concept
preferred label: Degen @de
preferred label: epee @en-gb
preferred label: エペ @ja-jp
preferred label: espada @pt-pt
preferred label: Epée @fr
definition: category of fencing using a weapon with a triangular cross-section blade and a large bell guard. @en-gb
definition: catégorie d'arme pour pratiquer l'escrime : lame rigide et triangulaire emmanchée dans une poignée munie d'une garde @fr
definition: Categoria de esgrima que usa uma arma com lâmina rígida e triangular, dotada de empunhadura com guarda-mão grande. @pt-br
definition: Arma con lama di sezione triangolare che viene usata di punta e che può colpire tutto il corpo
definition: 三角形の断面を持つ刃と大きな釣り鐘状のガードがついている武器を使用するフェンシング競技のひとつ @ja-jp
definition: Kategorie des Fechtens mit einer Waffe, die aus einer dreieckigen Querschnittklinge und einem großen Korbschutz (Glocke) besteht. @de
definition: Categoría de esgrima usando un arma con hoja rígida y de forma triangular, con empuñadura que consta de una protección en forma de campana. @es
note: nessuno
in scheme: subjectcode
created: 2000-10-30T12:00:00+00:00
modified: 2010-12-15T17:01:09+00:00
broader: http://cv.iptc.org/newscodes/subjectcode/15023000