Fioretto
type: Concept
preferred label: florete @pt-pt
preferred label: foil @en-gb
preferred label: Florett @de
preferred label: フルーレ @ja-jp
preferred label: Fleuret @fr
definition: Kategorie des Fechtens mit einer Waffe, die aus einer rechteckigen Querschnittklinge besteht und einem kleinen Korbschutz (Glocke) besteht. @de
definition: catégorie d'arme pour pratiquer l'escrime : lame lame flexible et rectangulaire au bout garni de peau @fr
definition: Categoria de esgrima que usa uma arma com lâmina flexível e quadrangular, dotada de empunhadura com pequeno guarda-mão. @pt-pt
definition: Arma con una lama rettangolare che può colpire solo di punta, il cui bersaglio valido è tutto il tronco
definition: 四角形の断面を持つ刃と小さな釣り鐘状のガードがついている武器を使用するフェンシング競技のひとつ @ja-jp
definition: Categoría de esgrima usando un arma blanca con hoja flexible y rectangular, adosada de una pequeña protección en forma de campana para la mano. @es
definition: category of fencing using a weapon with a rectangular cross-section blade and a small bell guard. @en-gb
note: nessuno
in scheme: subjectcode
created: 2000-10-30T12:00:00+00:00
modified: 2010-12-15T17:01:09+00:00
broader: http://cv.iptc.org/newscodes/subjectcode/15023000