hóquei em campo
type: Concept
preferred label: Feldhockey @de
preferred label: hockey sobre césped @es
preferred label: Hockey su prato @it
preferred label: Hockey sur gazon @fr
preferred label: ホッケー @ja-jp
preferred label: field Hockey @en-gb
definition: jeu de balle et de crosse où deux équipes de 11 joueurs essayent de marquer le plus de buts à l'adversaire @fr
definition: *Jogo de bola envolvendo duas equipes de 11 jogadores que usam tacos (**sticks**) curvos na ponta inferior para bater uma bola pequena e dura. O objetivo é marcar o maior número de gols.*
definition: 1チームは11人で構成され、曲がったスティツクを用いチーム同士で対戦するボールスポーツ。出来るだけ多くゴールを決め、得点することが目標 @ja-jp
definition: Deporte de pelota entre dos equipos de 11 jugadores que disputan la bocha con bastones de punta curva. El objetivo es anotar la mayor cantidad de goles. @es
definition: A ball sport involving two teams of 11 players using curved sticks. The aim is to score as many goals as possible. @en-gb
definition: Sport che vede fronteggiarsi due squadre di 11 giocatori ciascuna che usano dei bastoni curvi per segnare quante più reti all'avversario @it
definition: *Jogo de bola envolvendo duas equipas de 11 jogadores que usam tacos (**sticks**) curvos na ponta inferior para bater uma bola pequena e dura. O objetivo é marcar o maior número de golos.*
definition: Eine Ballsportart mit zwei Teams je 11 Spielern und einem gebogenen Stock. Das Ziel ist so viele Tore zu machen wie möglich. @de
note: nessuno @it
in scheme: subjectcode
created: 2000-10-30T12:00:00+00:00
modified: 2010-12-15T17:01:09+00:00
broader: http://cv.iptc.org/newscodes/subjectcode/15000000
narrower: http://cv.iptc.org/newscodes/subjectcode/15024001