patinação artística
type: Concept
preferred label: フィギュアスケート @ja-jp
preferred label: Patinage artistique @fr
preferred label: Pattinaggio artistico @it
preferred label: patinagem artística
preferred label: figure Skating @en-gb
preferred label: Eiskunstlauf @de
preferred label: patinaje artístico @es
definition: Disciplina individuale o di coppia che consiste nell'effettuare figure artistiche o danzare su una base musicale @it
definition: Los patinadores son juzgados por nueve jueces que otorgan puntos para dos secciones preparadas, en las que deben ejecutar figuras al compás de la música, procurando conjugar armónicamente belleza artística y precisión técnica. @es
definition: Um von neun Punktrichtern die beste Punktzahl zu bekommen in zwei vorbereiteten Bereichen - beide zu Musik gelaufen - müssen die Wettkämpfer die höchst mögliche Harmonie zwischen artistischem Ausdruck und technischer Präzision erreichen. @de
definition: 9人の審判から一番よい採点を得るために、競技者は2つの種目(どちらも音楽に合わせてスケートする)で最高の芸術点と技術点を獲得することを試みる @ja-jp
definition: To obtain the best marks possible from nine judges who award scores after two prepared sections - both skated to music - during which competitors must attempt to achieve the greatest possible harmony between artistic flair and technical precision. @en-gb
definition: Desporto, individual ou em pares, em que os patinadores são avaliados por 9 juízes após cada programa apresentado. Os patinadores devem executar figuras e movimentos ao som da música, conjugando beleza artística e precisão técnica.
definition: Esporte, individual ou em pares, em que os patinadores são avaliados por 9 juízes após cada programa apresentado. Os patinadores devem executar figuras e movimentos ao som da música, conjugando beleza artística e precisão técnica.
definition: sport individuel ou en couple consistant à effectuer des figures ou des danses sur glace @fr
note: nessuno @it
in scheme: subjectcode
created: 2000-10-30T12:00:00+00:00
modified: 2010-12-15T17:01:09+00:00
broader: http://cv.iptc.org/newscodes/subjectcode/15000000
narrower: http://cv.iptc.org/newscodes/subjectcode/15025001
narrower: http://cv.iptc.org/newscodes/subjectcode/15025002
narrower: http://cv.iptc.org/newscodes/subjectcode/15025003