Golf
type: Concept
preferred label: ゴルフ @ja-jp
preferred label: golf @es
preferred label: golfe @pt-br
definition: jeu consistant à placer une balle avec un club dans une série de trous répartis le long d'un parcours, et ce, en moins de coups possible @fr
definition: I concorrenti tentano di colpire una piccola palla bianca con mazze di differente tipo lungo un percorso di 18 buche di varia distanza. L'obiettivo è fare meno tiri possibile @it
definition: Jogo em que os participantes batem uma pequena bola branca com diferentes tacos ao longo de um campo de 18 buracos, que variam em distância. O objetivo é fazer a bola entrar nos buracos com o menor número possível de tacadas. @pt-br
definition: 種類の異なるクラブを使って小さい白いボールを打ちながら、距離の異なる18のコースをまわる競技で、最も少ない打数でまわることが目的 @ja-jp
definition: Competitors attempt to hit a small white ball with different clubs around a course of 18 holes varying in distance. The object is to make the fewest strokes possible. @en-gb
definition: Wettkämpfer versuchen einen kleinen weißen Ball mit verschiedenen Schlägern in einem Gelände mit 18 Löchern auf verschiedenen Distanzen einzulochen. Das Ziel ist die wenigsten Schläge zu benötigen.
definition: Los jugadores deben introducir una pequeña pelota blanca y maciza con diferentes palos en los 18 hoyos, de distancia variable, que conforman el circuito. El objetivo es completar el recorrido en la menor cantidad de golpes posible. @es
note: nessuno @it
in scheme: subjectcode
created: 2000-10-30T12:00:00+00:00
modified: 2010-12-15T17:01:09+00:00
broader: http://cv.iptc.org/newscodes/subjectcode/15000000