Esercizio a terra
type: Concept
preferred label: solo @pt-pt
preferred label: floor exercise @en-gb
preferred label: ejercicios en el suelo @es
preferred label: Bodenturnen @de
preferred label: 床運動 @ja-jp
preferred label: Sol @fr
definition: 12m四方のマット上で行う体操床運動 @ja-jp
definition: Exercício de ginástica no solo, em estrado de 12m x 12m. @pt-br
definition: Eine gymnastische Bodenübung auf einer 12 m Matte. @de
definition: A gymnastics floor exercise on a 12m/sq matt. @en-gb
definition: Esercizio praticato a terra su un tappeto di 12mq.
definition: Ejercicios de gimnasia en el suelo, sobre un tapete de 12 metros cuadrados de superficie. @es
definition: exercice de gymnastique pratiquée sur un tapis carré de 12m de coté @fr
definition: Exercício de ginástica no solo, em tapete de 12m x 12m. @pt-pt
note: nessuno
in scheme: subjectcode
created: 2000-10-30T12:00:00+00:00
modified: 2010-12-15T17:01:09+00:00
broader: http://cv.iptc.org/newscodes/subjectcode/15028000
broad match: http://cv.iptc.org/newscodes/mediatopic/20001152