cavalo com alças
type: Concept
preferred label: pommel horse @en-gb
preferred label: Cavallo @it
preferred label: Cheval d'arçon @fr
preferred label: potro con arcos @es
preferred label: あん馬 @ja-jp
preferred label: Seitpferd @de
preferred label: cavalo de arções
definition: Turner zeigen einen nicht unterbrochenen Schwung über ein Pferd mit Handgriffen unter Einsatz von Balance und Kraft. @de
definition: Prova masculina em que os ginastas executam uma sequência ininterrupta de movimentos, balançando o corpo sobre um cavalo com alças, combinando equilíbrio e força.
definition: 取っ手の付いた鞍馬上をバランスと力で絶え間なく揺れ動く競技 @ja-jp
definition: excercice de gymnastique qui consiste à effectuer mouvements ininterrompus sur un cheval muni d'arçons en bois @fr
definition: Movimenti ininterrotti oscillando su un cavallo dotato di maniglie, usando equilibrio e forza @it
definition: Gymnasts perform an uninterrupted swing motion over a handled horse using balance and strength. @en-gb
definition: Prova masculina em que os ginastas executam uma sequência ininterrupta de movimentos, balançando o corpo sobre um cavalo de arções, combinando equilíbrio e força.
definition: Gimnastas interpretan una sesión de movimientos ininterrrumpidos sobre un potro con anillas, combinando balance y fuerza. @es
note: nessuno @it
in scheme: subjectcode
created: 2000-10-30T12:00:00+00:00
modified: 2010-12-15T17:01:09+00:00
broader: http://cv.iptc.org/newscodes/subjectcode/15028000
broad match: http://cv.iptc.org/newscodes/mediatopic/20001152