Cerchio
type: Concept
preferred label: フープ @ja-jp
preferred label: arco @pt-pt
preferred label: aro @es
preferred label: Reifen @de
preferred label: hoop @en-gb
preferred label: cerceau @fr
definition: Si fa rotolare e si lancia un cerchio mentre si realizza un passo di danza
definition: Exercício de ginástica rítmica em que as ginastas realizam uma coreografia no solo usando um arco. @pt-pt
definition: Ein Reifen wird lange gerollt und geworfen in einer Tanzperformance. @de
definition: La gimnasta lanza y hace rodar un aro para cumplir una rutina de danza. @es
definition: ダンス演技をしている間、フープ(輪)を転がしたり、放り投げたりする @ja-jp
definition: exercices utilisant un cerceau en le roulant et en le lançant @fr
definition: A hoop is rolled and thrown whilst performing a dance routine. @en-gb
note: nessuno
in scheme: subjectcode
created: 2000-10-30T12:00:00+00:00
modified: 2010-12-15T17:01:09+00:00
broader: http://cv.iptc.org/newscodes/subjectcode/15028000
broad match: http://cv.iptc.org/newscodes/mediatopic/20000951