andebol
type: Concept
preferred label: Pallamano @it
preferred label: Handball @de
preferred label: ハンドボール @ja-jp
preferred label: balonmano @es
preferred label: handebol
preferred label: handball (team) @en-gb
definition: Deporte que enfrenta a dos equipos de siete jugadores, que intentan anotar introduciendo una pelota en el arco rival utilizando solo las manos. @es
definition: Jogo de bola de duas equipas de 7 jogadores que tentam introduzir a bola na baliza do adversário através de passes apenas com as mãos.
definition: A ball game using the hands contested by two teams of seven trying to throw the ball into the opponents goal. @en-gb
definition: Jeu de ballon joué à la main opposant deux équipes de sept joueurs chacune essayant de marquer le plus de buts possibles. @fr
definition: Ein Ballspiel mit den Händen, bestehend aus zwei Teams mit jeweils sieben Spielern, die versuchen den Ball in das gegnerische Tor zu werfen. @de
definition: Un gioco in cui una palla è contesa da due squadre di sette giocatori ciascuna i quali, usando le mani, cercano di lanciarla nella porta avversaria @it
definition: Jogo de bola de duas equipes de 7 jogadores que tentam introduzir a bola no gol do adversário através de passes apenas com as mãos.
definition: 手を使って、7人一組の2チームが相手ゴールへボールを投げ入れあう球技 @ja-jp
note: nessuno @it
in scheme: subjectcode
created: 2000-10-30T12:00:00+00:00
modified: 2010-12-15T17:01:09+00:00
broader: http://cv.iptc.org/newscodes/subjectcode/15000000