Trotto
type: Concept
preferred label: Course de trot @fr
preferred label: Trabrennen @de
preferred label: トロッティング @ja-jp
preferred label: trote @pt-pt
preferred label: trotting @en-gb
definition: *Corrida de cavalos atrelados a um **buggy** em pista plana sem obstáculos.* @pt-pt
definition: Pferdewagenrennen mit Jokey im Trab auf einer flachen Bahn. @de
definition: Cavalli lanciati in una corsa al trotto con carretto guidato lungo un percorso senza ostacoli
definition: Course pratiquée au trot @fr
definition: Horses pitched to a jockeyed buggy race in a trot round a flat course. @en-gb
definition: Carrera de caballos al trote alrededor de un camino llano. @es
definition: 2輪車を引いた馬が平らなコースを速足で周回するレース @ja-jp
note: nessuno
in scheme: subjectcode
created: 2000-10-30T12:00:00+00:00
modified: 2010-12-15T17:01:09+00:00
broader: http://cv.iptc.org/newscodes/subjectcode/15030000