Hockey su slitta
type: Concept
preferred label: スレッジホッケー @ja-jp
preferred label: hóquei em trenó @pt-br
preferred label: sledge hockey @en-gb
preferred label: hockey en trineo @es
preferred label: Sledge hockey @fr
preferred label: Eisschlittenhockey @de
definition: Modalidade semelhante ao hóquei no gelo mas praticada com pequenos trenós que os patinadores empurram com os braços. @pt-pt
definition: Hockey sur glace pratiqué sur luge. Les déplacements se faisant à la force des bras @fr
definition: Ähnlich wie Eishockey, aber auf kleinen Schlitten. Die Wettkämpfer bewegen sich mit Hilfe der Arme fort. @de
definition: Como el hockey sobre hielo pero en lugar de usar patines, los competidores emplean pequeños trineos y se deslizan empujándose con sus brazos. @es
definition: アイスホッケーに似ているが、スケートの代わりに小さなソリ(スレッジ)を使用するもの。競技者は両腕で漕ぎながら移動する @ja-jp
definition: Like ice hockey but instead of skates small sledges are used. Competitors move by pushing with the arms @en-gb
definition: Simile all'hockey su ghiaccio ma al posto dei pattini si usano delle piccole slitte. I concorrenti si muovono spingendosi con le braccia
note: nessuno
in scheme: subjectcode
created: 2000-10-30T12:00:00+00:00
modified: 2010-12-15T17:01:09+00:00
broader: http://cv.iptc.org/newscodes/subjectcode/15031000