Pelota
type: Concept
preferred label: Pelote basque @fr
preferred label: ハイアライ（ペロタ） @ja-jp
preferred label: pelota basca @pt-pt
preferred label: Jai Alai (Pelota) @en-gb
preferred label: pelota vasca @es
preferred label: Pelota/Jai Alai @de
definition: Desporto ancestral do País Basco em que dois ou quatro participantes batem alternadamente uma bola contra uma parede frontal com uma espécie de pá. @pt-pt
definition: sport ancestral du Pays Basque qui consiste à faire rebondir une balle contre un fronton (mur) @fr
definition: Deporte ancestral del País Vasco que consiste en hacer golpear con una paleta y hacer rebotar una bola contra un muro, similar al frontón. @es
definition: Die Komplexität des Spiels erfordert es zwei SubjectDetails zu kombinieren, um eine angemessene Identifizierung der speziellen Varianten zu ermöglichen. @de
definition: Because of the game organization, the proper identification of a specific game may require the combination of 2 subject details @en-gb
definition: Antico sport dei Paesi Baschi che consiste nel far rimbalzare una palla contro un fronton-muro. Ha numerose varianti, di seguito elencate
definition: ゲーム編成の理由により、特定のゲームの本来の識別では、2つのsubject detailsの組み合わせを必要とするかもしれない @ja-jp
note: nessuno
in scheme: subjectcode
created: 2000-10-30T12:00:00+00:00
modified: 2010-12-15T17:01:09+00:00
broader: http://cv.iptc.org/newscodes/subjectcode/15000000
narrower: http://cv.iptc.org/newscodes/subjectcode/15032001
narrower: http://cv.iptc.org/newscodes/subjectcode/15032002
narrower: http://cv.iptc.org/newscodes/subjectcode/15032003
narrower: http://cv.iptc.org/newscodes/subjectcode/15032004
narrower: http://cv.iptc.org/newscodes/subjectcode/15032005
narrower: http://cv.iptc.org/newscodes/subjectcode/15032006
narrower: http://cv.iptc.org/newscodes/subjectcode/15032007
narrower: http://cv.iptc.org/newscodes/subjectcode/15032008
narrower: http://cv.iptc.org/newscodes/subjectcode/15032009
narrower: http://cv.iptc.org/newscodes/subjectcode/15032010
narrower: http://cv.iptc.org/newscodes/subjectcode/15032011
narrower: http://cv.iptc.org/newscodes/subjectcode/15032012