Chistera ancha
type: Concept
preferred label: chistera ancha @pt-pt
preferred label: システラカンチャ @ja-jp
definition: The *chistera-ancha* also called the *cesta punta* is the game played in a *jaï alai* with 1 or 2 players in each team. The players use a long curved basket called the *chistera* (68 cm long and 13 cm wide). @en-gb
definition: Die *Chistera ancha*, auch *Cesta punta* genannt, ist eine Spielvariante mit ein bis zwei Spielern pro Team in der *Jai-Alai*. Die Spieler benutzen einen langen gebogenen Korbschläger, *Chistera* (68 cm lang und 13 cm breit) bezeichnet. @de
definition: Chiamata anche *cesta punta*, si gioca in un *jai alai* con 1 o 2 giocatori per squadra, i quali, usano una lunga cesta chiamata *chistera* (lunga 68 cm e larga 13 cm)
definition: También llamada *cesta punta*, es el juego que se realiza en un *jai alai* con 1 o 2 jugadores en cada equipo. Los mismos utilizan un canasto largo y curvo llamado chistera (68cm de largo por 13 de ancho). @es
definition: *A **chistera ancha**, também chamada **cesta punta**, é uma modalidade disputada com uma **chistera** grande (68 cm de comprimento e 13 cm de largura) por 1 ou 2 jogadores em cada equipe.* @pt-br
definition: *A **chistera ancha**, também chamada **cesta punta**, é uma modalidade disputada com uma **chistera** grande (68 cm de comprimento e 13 cm de largura) por 1 ou 2 jogadores em cada equipa.* @pt-pt
definition: chistera-anchaは*cesta punta*とも呼ばれ、各チーム1～2名で行われるハイアライ。プレーヤーは*chistera*(長さ68cm、幅13cm)と呼ばれる長く湾曲した籠を使用する @ja-jp
definition: Ou cesta-punta se joue en jaï-alaï à l'aide de grands chisteras et avec 1 ou 2 joueurs dans chaque équipe. @fr
note: nessuno
in scheme: subjectcode
created: 2000-10-30T12:00:00+00:00
modified: 2010-12-15T17:01:09+00:00
broad match: http://cv.iptc.org/newscodes/mediatopic/20000968
broader: http://cv.iptc.org/newscodes/subjectcode/15032000