chistera corta
type: Concept
preferred label: Chistera corta @de
preferred label: システラコータ @ja-jp
definition: *A **chistera corta** é uma modalidade de frontão de parede esquerda disputada com uma **chistera** (56 cm de comprimento e 12 cm de largura) por 3 jogadores em cada equipe.*
definition: The *chistera-corta* is the game played in a fronton *place libre* with left hand wall and 3 players in each team. The players use a long curved basket called the *chistera* (56 cm long and 12 cm wide). @en-gb
definition: *A **chistera corta** é uma modalidade de frontão de parede esquerda disputada com uma **chistera** (56 cm de comprimento e 12 cm de largura) por 3 jogadores em cada equipa.*
definition: Se joue en place libre avec un mur gauche et 3 joueurs dans chaque équipe. Le joueurs utilisent un long gant d'osier la chistera @fr
definition: Si gioca in un fronton *place libre* con la parete sinistra e 3 giocatori per squadra, i quali, usano una lunga cesta chiamata *chistera* (lunga 56 cm e larga 12 cm) @it
definition: Juego que se practica en un frontón al descubierto, con pared de mano izquierda y tres jugadores en cada equipo. Los mismos utilizan un canasto largo y curvo llamado chistera (56 x 12cm) @es
definition: Bei der *Chistera corta* wird mit drei Spielern pro Team auf einem Spielfeld dem *place libre* mit einer linksseitigen Wand gespielt. Die Spieler verwenden einen langen gebogenen Schläger,*Chistera* (56 cm lang und 12 cm breit) bezeichnet. @de
definition: *chistera-corta*は、各チーム3人のプレーヤーが*Place libre*フロントンの左手の壁で行うゲーム。 プレーヤーはセスタと呼ばれる長いカーブしたバスケット(長さ56センチと幅12センチ)を使う @ja-jp
note: nessuno @it
in scheme: subjectcode
created: 2000-10-30T12:00:00+00:00
modified: 2010-12-15T17:01:09+00:00
broad match: http://cv.iptc.org/newscodes/mediatopic/20000968
broader: http://cv.iptc.org/newscodes/subjectcode/15032000