mão nua
type: Concept
preferred label: mano desnuda o descubierta @es
preferred label: bare hand @en-gb
preferred label: ベアハンド @ja-jp
preferred label: Mani nude @it
preferred label: Freihand @de
preferred label: main nue @fr
definition: The *Main Nue*(bare hand)は、すべてのバスクのスポーツの起源 @ja-jp
definition: *O **main nue** (mão nua), jogo em que a bola é batida com a própria mão contra a parede, é o antecessor de todos os desportos bascos de pelota. Pode ser jogado em trinquete ou em parede esquerda. *
definition: *O **main nue** (mão nua), jogo em que a bola é batida com a própria mão contra a parede, é o antecessor de todos esportes bascos de pelota. Pode ser jogado em trinquete ou em parede esquerda. *
definition: El denominado *Main Nue* (mano desnuda) es el antecesor de todos los deportes vascos de pelota, se golpea la pelota con la mano y se puede jugar en trinquete o muro izquierdo. @es
definition: E'l'antenato di tutti gli sport baschi con la palla @it
definition: The *Main Nue* (bare hand) is the ancestor of all Basque sports. @en-gb
definition: Die *Main Nue*-Variante (bloße Hand) ist der Vorläufer des baskischen Nationalsports. @de
definition: on frappe la balle à la main. La main nue se pratique en mur à gauche et trinquet. @fr
note: nessuno @it
in scheme: subjectcode
created: 2000-10-30T12:00:00+00:00
modified: 2010-12-15T17:01:09+00:00
broad match: http://cv.iptc.org/newscodes/mediatopic/20000968
broader: http://cv.iptc.org/newscodes/subjectcode/15032000