Pala ancha
type: Concept
preferred label: パラカンチャ @ja-jp
preferred label: pala-ancha @pt-pt
preferred label: Pala-ancha @de
preferred label: pala ancha @es
definition: Die *Pala ancha*-Variante wird auf einem Spielfeld dem *place libre* mit zwei Spielern pro Team gespielt. Die Spieler benutzen ein schweres hölzernes Brett als Schläger die, *Pala* (50 cm lang und 20 cm breit). @de
definition: *A **pala-ancha** é uma modalidade de frontão disputada com uma **pala** (pesado bastão de madeira de 50 cm de comprimento e 20 cm de largura) por 2 jogadores em cada equipa.* @pt-pt
definition: The *pala-ancha* is the game played in a fronton *place libre* with 2 players in each team. The players use a heavy wooden bat *the pala* (50 cm long and 20 cm wide). @en-gb
definition: Se joue en place libre avec 2 joueurs dans chaque équipe. Les joueurs utilise une sorte de raquette en bois large et lourde appelée *pala* @fr
definition: Juego que se practica en un frontón al descubierto con dos jugadores por equipo, que utilizan una pesada paleta de madera (la pala), de 50 cm de largo y 20 cm de ancho. @es
definition: Si gioca in un fronton *place libre* con 2 giocatori per squadra, i quali, usano una pesante mazza di legno *la pala* (lunga 50 cm e larga 20 cm)
definition: *pala-ancha*は各チーム2人のプレーヤーが、*place libre*フロントンで行うゲーム。プレーヤーは重い木製のバットの*the pala*(長さ50センチと幅20センチ)を使う @ja-jp
definition: *A **pala-ancha** é uma modalidade de frontão disputada com uma **pala** (pesado bastão de madeira de 50 cm de comprimento e 20 cm de largura) por 2 jogadores em cada equipe.* @pt-br
note: nessuno
in scheme: subjectcode
created: 2000-10-30T12:00:00+00:00
modified: 2010-12-15T17:01:09+00:00
broader: http://cv.iptc.org/newscodes/subjectcode/15032000
broad match: http://cv.iptc.org/newscodes/mediatopic/20000968