Mediomassimi
type: Concept
preferred label: 軽重量級 @ja-jp
preferred label: peso mediopesado @es
preferred label: half-heavyweight @en-gb
preferred label: peso meio pesado @pt-br
preferred label: Mi-lourds @fr
preferred label: Halb-Schwergewicht @de
definition: Gewichtsklasse in Judo: bis zu 100 kg bei Männern und 78 kg bei Frauen. @de
definition: catégorie de poids variant dans le temps et entre hommes et femmes. Jusqu'à 100 kg pour les hommes et 78 kg pour les femmes @fr
definition: Uomini fino a 100 kg, donne fino a 78 kg
definition: Weight categoriy in Judo: up to 100kg for men and 78kg for women. @en-gb
definition: 男子最高100kg、女子最高78kg @ja-jp
definition: Categoria até 100kg para homens e até 78kg para mulheres. @pt-pt
definition: Hasta 100 kg. para hombres y 78 kg. para mujeres. @es
note: nessuno
in scheme: subjectcode
created: 2000-10-30T12:00:00+00:00
modified: 2010-12-15T17:01:09+00:00
broad match: http://cv.iptc.org/newscodes/mediatopic/20000971
broader: http://cv.iptc.org/newscodes/subjectcode/15033000