Medi
type: Concept
preferred label: 中量級 @ja-jp
preferred label: Moyens @fr
preferred label: peso mediano @es
preferred label: Mittelgewicht @de
preferred label: peso médio @pt-pt
preferred label: middleweight @en-gb
definition: Categoria até 90kg para homens e até 70kg para mulheres. @pt-br
definition: Gewichtsklasse in Judo: bis zu 90 kg bei Männern und 70 kg bei Frauen. @de
definition: Uomini fino a a 90 kg, donne fino a 70 kg
definition: 男子最高90kg、女子最高70kg @ja-jp
definition: catégorie de poids variant dans le temps et entre hommes et femmes. Jusqu'à 90 kg pour les hommes et 70 kg pour les femmes @fr
definition: Weight categoriy in Judo: up to 90kg for men and 70kg for women. @en-gb
definition: Hasta 90 kg. para hombres y 70 kg. para mujeres. @es
note: nessuno
in scheme: subjectcode
created: 2000-10-30T12:00:00+00:00
modified: 2010-12-15T17:01:09+00:00
broader: http://cv.iptc.org/newscodes/subjectcode/15033000
broad match: http://cv.iptc.org/newscodes/mediatopic/20000976