peso meio ligeiro
type: Concept
preferred label: Mi-légers @fr
preferred label: half-lightweight @en-gb
preferred label: Halb-Leichtgewicht @de
preferred label: peso meio leve
preferred label: peso medio liviano @es
preferred label: Medioleggeri @it
preferred label: 軽軽量級 @ja-jp
definition: Uomini fino a 73 kg, donne fino a 57 kg @it
definition: 男子最高73kg、女子最高57kg @ja-jp
definition: Weight categoriy in Judo: up to 73kg for men and 57kg for women. @en-gb
definition: Categoria até 73kg para homens e até 57kg para mulheres.
definition: Hasta 73 kg. para hombres y 57 kg. para mujeres. @es
definition: catégorie de poids variant dans le temps et entre hommes et femmes. Jusqu'à 73 kg pour les hommes et 57 kg pour les femmes @fr
definition: Gewichtsklasse in Judo: bis zu 73 kg bei Männern und 57 kg bei Frauen. @de
note: nessuno @it
in scheme: subjectcode
created: 2000-10-30T12:00:00+00:00
modified: 2010-12-15T17:01:09+00:00
broad match: http://cv.iptc.org/newscodes/mediatopic/20000972
broader: http://cv.iptc.org/newscodes/subjectcode/15033000