peso ligeiro
type: Concept
preferred label: lightweight @en-gb
preferred label: Leichtgewicht @de
preferred label: Légers @fr
preferred label: 軽量級 @ja-jp
preferred label: Peso leggero @it
preferred label: peso leve
preferred label: peso liviano @es
definition: Hasta 66 kg. para hombres y 52 kg. para mujeres. @es
definition: catégorie de poids variant dans le temps et entre hommes et femmes. Jusqu'à 66 kg pour les hommes et 52 kg pour les femmes @fr
definition: Weight categoriy in Judo: up to 66kg for men and 52kg for women. @en-gb
definition: Uomini fino a 66 kg, donne fino a 52 kg @it
definition: Categoria até 66kg para homens e até 52kg para mulheres.
definition: 男子最高66kg、女子最高52kg @ja-jp
definition: Gewichtsklasse in Judo: bis zu 66 kg bei Männern und 52 kg bei Frauen. @de
note: nessuno @it
in scheme: subjectcode
created: 2000-10-30T12:00:00+00:00
modified: 2010-12-15T17:01:09+00:00
broader: http://cv.iptc.org/newscodes/subjectcode/15033000
broad match: http://cv.iptc.org/newscodes/mediatopic/20000975