caratê
type: Concept
preferred label: karate @es
preferred label: Karate @it
preferred label: 空手 @ja-jp
preferred label: Karaté @fr
preferred label: caraté
definition: Arte marziale in cui colpi, pugni, calci e spinte sono usati per sconfiggere un avversario @it
definition: 相手を打ち負かすために手刀、突き、蹴りや投げを用いる武術 @ja-jp
definition: Arte marcial que usa golpes de mãos e pés para derrubar o adversário.
definition: A martial art where chops, punches, kicks and throws are used to defeat an opponent. @en-gb
definition: sport de combat et d'autodéfense où deux combattants s'affrontent sans porter les coups à l'aide de leurs mains (le tranchant), leurs pieds (coup de pied sauté ou circulaires) et leurs poings @fr
definition: Arte marcial japonés, deporte de combate y defensa personal con diferentes escuelas, en el que se utilizan las manos (en forma de corte y puñetazos) y las piernas (patadas circulares o rectas, bajas o altas y con saltos) para derrotar al oponente. @es
definition: Eine Kampfsportart bei der Hiebe, Schläge, Tritte und Würfe genutzt werden um einen Angreifer abzuwehren. @de
note: nessuno @it
in scheme: subjectcode
created: 2000-10-30T12:00:00+00:00
modified: 2010-12-15T17:01:09+00:00
broader: http://cv.iptc.org/newscodes/subjectcode/15000000
narrower: http://cv.iptc.org/newscodes/subjectcode/15034001
narrower: http://cv.iptc.org/newscodes/subjectcode/15034002