lacrosse
type: Concept
preferred label: Lacrosse @de
preferred label: ラクロス @ja-jp
definition: sport joué par deux équipes qui doivent se marquer des buts en se disputant une balle avec un bâton terminé par un panier triangulaire souple @fr
definition: Zwei Teams mit gepolsterten Spielern mit Helmen versuchen sich gegenseitig zu besiegen mit einem Schläger und einem harten Ball. @de
definition: Dos equipos de jinetes, munidos de cascos, tratan de vencer al oponente utilizando un bastón con red y una pelota dura. @es
definition: Sport di squadra praticato essenzialmente in Nord America e in Australia, che consiste nel far punto in una porta con una palla passata da atleta ad atleta tramite una specie di racchetta. Ogni squadra è composta da 10 giocatori; la porta è simile a quella dell'hockey su ghiaccio: alta 1,8 m e larga 1,8 m @it
definition: Two teams of helmeted and padded players try and outscore each other using a netted stick and hard ball.
definition: Jogo disputado por 2 equipes de jogadores devidamente protegidos que usam um taco longo e com rede na ponta para apanhar ou arremessar uma bola dura. @pt-br
definition: ヘルメットや防具を付けたプレーヤーが、2チームで網を張ったスティックを使用し、互いに得点し合う @ja-jp
definition: Jogo disputado por 2 equipas de jogadores devidamente protegidos que usam um taco longo e com rede na ponta para apanhar ou arremessar uma bola dura. @pt-pt
note: nessuno @it
in scheme: subjectcode
created: 2000-10-30T12:00:00+00:00
modified: 2010-12-15T17:01:09+00:00
broader: http://cv.iptc.org/newscodes/subjectcode/15000000