Individuale
type: Concept
preferred label: individual @es
preferred label: singles @en-gb
preferred label: １人乗り @ja-jp
preferred label: singulares @pt-br
preferred label: Einsitzer @de
preferred label: monoplace @fr
definition: compétition dans une luge à une place @fr
definition: Gara di velocità con slittino monoposto
definition: Prueba de trineo (luge) individual. @es
definition: Prova individual em trenó de 1 lugar. @pt-pt
definition: individual time trial event in a one seater luge @en-gb
definition: 1人乗りリュージュでの個人タイムトライアル競技 @ja-jp
definition: Zeitrennen für einen Einer-Schlitten. @de
note: nessuno
in scheme: subjectcode
created: 2000-10-30T12:00:00+00:00
modified: 2010-12-15T17:01:09+00:00
broader: http://cv.iptc.org/newscodes/subjectcode/15036000
broad match: http://cv.iptc.org/newscodes/mediatopic/20000987