Fórmula 3000
type: Concept
preferred label: F3000 @en-gb
preferred label: fórmula 3000 @es
preferred label: Ｆ３０００ @ja-jp
definition: Corrida de velocidade de monopostos, com motores menos potentes que os de F1. Os pilotos competem individualmente e por equipes em vários circuitos mundiais, segundo especificações da Federação Internacional do Automóvel (FIA).
definition: Using less powerful motors than the Formula One, designated construction teams race over varied circuits the world over in speed races for individual and team honours over a season. @en-gb
definition: F1ほど強力ではないエンジンを使い、指定されたコンストラクション･チームは、シーズンを通して世界中のさまざまなスピードレースのサーキットで個人とチームの名誉のためにレースを行う @ja-jp
definition: course de voitures monoplace uniquement conçues pour les courses de vitesse sur circuit et construites par le constructeur désigné par la FIA selon une spécicfication établie par le FIA @fr
definition: Corrida de velocidade de monolugares, com motores menos potentes que os de F1. Os pilotos competem individualmente e por equipas em vários circuitos mundiais, segundo especificações da Federação Internacional do Automóvel (FIA).
definition: Mit weniger starken Motoren als bei der Formel 1, fahren ausgewählte Konstrukteur-Teams über verschiedene Runden weltweit Geschwindigkeitsrennen im Einzel- und Teamwettbewerb über eine Saison. @de
definition: Carrera de autos monoplaza, con motores de menor poder que los de F1. Compiten en forme individual y por equipos, en variados circuitos alrededor del mundo según especificaciones de la organización FIA. @es
definition: Corsa automobilistica su monoposto su vari circuiti, si usano motori meno potenti della F1 @it
note: nessuno @it
in scheme: subjectcode
created: 2000-10-30T12:00:00+00:00
modified: 2010-12-15T17:01:09+00:00
broader: http://cv.iptc.org/newscodes/subjectcode/15039000