Indy
type: Concept
preferred label: Formule Indy @fr
preferred label: Fórmula Indy @pt-br
preferred label: インディカー @ja-jp
preferred label: fórmula indy @es
definition: Rango más alto de la Liga Profesional estadounidense de carreras de velocidad en distintos circuitos. @es
definition: Nordamerikanische professionelle Topliga der Geschwindigkeitsrennen über Runden. @de
definition: サーキットでのスピードレースにおける北米トップクラスのプロリーグ @ja-jp
definition: Competição organizada pela liga profissional norte-americana de corridas de velocidade. @pt-pt
definition: North American top range professional league speed racing over circuits.
definition: competition se déroulant sur des circuits organisé par une ligue professsionnelle américaine @fr
definition: Gara di velocità sui circuiti organizzati in Nord America. @it
note: nessuno @it
in scheme: subjectcode
created: 2000-10-30T12:00:00+00:00
modified: 2010-12-15T17:01:09+00:00
broader: http://cv.iptc.org/newscodes/subjectcode/15039000