Endurance
type: Concept
preferred label: resistência @pt-br
preferred label: 耐久 @ja-jp
preferred label: endurance @en-gb
preferred label: resistencia @es
definition: épreuve de régularité et d'endurance organisée sur piste @fr
definition: 耐久ロードレース @ja-jp
definition: Corrida de estrada de resistência e regularidade. @pt-br
definition: Prova di regolarità e resistenza disputata su strada @it
definition: A road race of consistency and endurance @en-gb
definition: Carrera de resistencia y regularidad pero en ruta. @es
definition: Straßenrennen mit Belastung und Ausdauer.
note: nessuno @it
in scheme: subjectcode
created: 2000-10-30T12:00:00+00:00
modified: 2010-12-15T17:01:09+00:00
broader: http://cv.iptc.org/newscodes/subjectcode/15041000