10 km tecnica classica
type: Concept
preferred label: 10 km style classique @fr
preferred label: 10 km klassisch @de
preferred label: 10 km estilo clássico @pt-pt
preferred label: 10 km classical style @en-gb
preferred label: １０ｋｍクラシカル @ja-jp
preferred label: 10 km. estilo clásico @es
definition: Corsa tipica di 10 km in cui i concorrenti gareggiano tenendo i loro sci paralleli eccetto nei pendii scoscesi dove possono muoversi con gli sci a forbice
definition: 10Kmのクラシックスタイル・レース。競技者は、逆ハの字にするような急勾配を除くと、スキー板を並行に保つ @ja-jp
definition: Corrida clássica de 10km em que o esquiador mantém os esquis paralelos, exceto nas descidas pronunciadas, onde utiliza o movimento de tesoura. @pt-pt
definition: A 10km classic race in that the competitor keeps his skis parallel except on steep inclines where the scissor move is used @en-gb
definition: 10 km Rennen im klassichen Stil bei dem der Wettkämpfer seine Skier parallel führen muss außer bei Benutzung des *scissor move*. @de
definition: course de 10 km de style classique : le skieur garde les skis parallèles, sauf dans les montées à fort pourcentage, où il utilise le pas de ciseaux @fr
definition: Clásica carrera de 10 km. en la que los competidores mantienen sus esquís paralelos, excepto en pendientes, donde es usado el movimiento de tijera. @es
note: nessuno
in scheme: subjectcode
created: 2000-10-30T12:00:00+00:00
modified: 2010-12-15T17:01:09+00:00
broader: http://cv.iptc.org/newscodes/subjectcode/15043000
broad match: http://cv.iptc.org/newscodes/mediatopic/20001060