10 km perseguição estilo livre
type: Concept
preferred label: 10 km poursuite libre @fr
preferred label: 10 km pursuit free style @en-gb
preferred label: 10 km inseguimento in stile libero @it
preferred label: 10 km. persecución estilo libre @es
preferred label: 10 km Freistil @de
preferred label: １０ｋｍフリースタイル追い抜き @ja-jp
definition: 競技者間の位置に依存する時間差でスタートし、スキーでスケーティングのようなテクニックを使う @ja-jp
definition: Partenza a scaglioni in base alle posizioni dei concorrenti, i quali, possono usare la tecnica di pattinaggio sugli sci @it
definition: 10 km Rennen im Freistil mit Verfolgungsstart abhängig von Positionen, bei der die Wettkämpfer eine eislaufähnliche Technik auf Skiern (Skating) benutzen. @de
definition: Course de 10 km à départ échelonné où les concurrents utilisent une technique semblable à du patinage @fr
definition: Corrida de 10 km de largada escalonada em que os esquiadores utilizam uma técnica semelhante à patinação.
definition: Competencia en dos mangas en 10km, una estilo clásico contra reloj y partida escalonada, la otra estilo libre y con salida de acuerdo al tiempo de la primera fase. El que atraviesa primero la línea de meta gana. @es
definition: Staggered start depending on positions with competitors using a skating like technique on skis @en-gb
definition: Corrida de 10 km de largada escalonada em que os esquiadores utilizam uma técnica semelhante à patinagem.
note: nessuno @it
in scheme: subjectcode
created: 2000-10-30T12:00:00+00:00
modified: 2010-12-15T17:01:09+00:00
broader: http://cv.iptc.org/newscodes/subjectcode/15043000
broad match: http://cv.iptc.org/newscodes/mediatopic/20001060