15 km tecnica classica
type: Concept
preferred label: 15 km style classique @fr
preferred label: １５ｋｍクラシカル @ja-jp
preferred label: 15 km klassisch @de
preferred label: 15 km. estilo clásico @es
preferred label: 15 km estilo clássico @pt-pt
preferred label: 15 km classical style @en-gb
definition: Corrida clássica de 15km em que o esquiador mantém os esquis paralelos, exceto nas descidas pronunciadas, onde utiliza o movimento de tesoura. @pt-pt
definition: 15kmのクラシックスタイル+W1097レース。スキーを平行に保つ @ja-jp
definition: 15 km Rennen im klassischen Stil, bei dem die Skier parallel geführt werden. @de
definition: Carrera de 15 km., usando el clásico estilo de mantener los esquís paralelos, salvo en pendientes pronunciadas, donde se usa movimiento de tijera. @es
definition: A 15km race using the classical style of keeping skies parallel @en-gb
definition: course de 15km style classique : le skieur garde les skis parallèles, sauf dans les montées à fort pourcentage, où il utilise le pas de ciseaux @fr
definition: Corsa di 15 km nella quale si usa lo stile classico di tenere gli sci paralleli
note: nessuno
in scheme: subjectcode
created: 2000-10-30T12:00:00+00:00
modified: 2010-12-15T17:01:09+00:00
broad match: http://cv.iptc.org/newscodes/mediatopic/20001060
broader: http://cv.iptc.org/newscodes/subjectcode/15043000