15 km perseguição estilo livre
type: Concept
preferred label: 15 km poursuite libre @fr
preferred label: １５ｋｍフリースタイル追い抜き @ja-jp
preferred label: 15 km Freistil @de
preferred label: 15 km pursuit free style @en-gb
preferred label: 15 km inseguimento in stile libero @it
preferred label: 15 km. persecución estilo libre @es
definition: 15km race with staggered start using free style technique similar to a skating motion @en-gb
definition: Corsa di 15 km con partenza in scaglioni e nella quale si usa la tecnica dello stile libero, un moto simile a quello del pattinaggio @it
definition: Corrida de 10 km de largada escalonada em que os esquiadores utilizam uma técnica semelhante à patinação.
definition: 15Kmのフリースタイル・レースで、時間差でスタートする。スケーティング動作のようなテクニックを使う @ja-jp
definition: Carrera de 15 km. Con dos mangas en un día (estilo clásico contrarreloj y libre). @es
definition: Corrida de 15 km de largada escalonada em que os esquiadores utilizam uma técnica semelhante à patinagem.
definition: Course de 15 km à départ échelonné où les concurrents utilisent une technique semblable à du patinage @fr
definition: 15 km Rennen im Freistil mit Verfolgungsstart abhängig von Positionen, bei der die Wettkämpfer eine eislaufähnliche Technik auf Skiern (Skating) benutzen. @de
note: nessuno @it
in scheme: subjectcode
created: 2000-10-30T12:00:00+00:00
modified: 2010-12-15T17:01:09+00:00
broader: http://cv.iptc.org/newscodes/subjectcode/15043000
broad match: http://cv.iptc.org/newscodes/mediatopic/20001060