30 km tecnica classica
type: Concept
preferred label: ３０ｋｍクラシカル @ja-jp
preferred label: 30 km classical style @en-gb
preferred label: 30 km klassisch @de
preferred label: 30 km estilo clássico @pt-pt
preferred label: 30 km. estilo clásico @es
preferred label: 30 km style classique @fr
definition: Corsa di 30 km in cui gli sciatori tengono i loro sci paralleli eccetto sui pendii scoscesi dove possono usare il moto a forbice
definition: Corrida clássica de 30km em que o esquiador mantém os esquis paralelos, exceto nas descidas pronunciadas, onde utiliza o movimento de tesoura. @pt-pt
definition: 30kmのクラシック・レース。急勾配ではスキー逆ハの字に開くが、それ以外はスキーを平行に保つ @ja-jp
definition: A 30km classic race in that the competitor keeps his skis parallel except on steep inclines where the scissor move is used @en-gb
definition: course de 30km style classique : le skieur garde les skis parallèles, sauf dans les montées à fort pourcentage, où il utilise le pas de ciseaux @fr
definition: 30 km Rennen im klassichen Stil bei dem der Wettkämpfer seine Skier parallel führen muss außer bei Benutzung des *scissor move*. @de
definition: Carrera clásica de 30 km. donde los competidores dejan sus esquís paralelos, excepto en pendientes donde se utiliza el movimiento tijera. @es
note: nessuno
in scheme: subjectcode
created: 2000-10-30T12:00:00+00:00
modified: 2010-12-15T17:01:09+00:00
broader: http://cv.iptc.org/newscodes/subjectcode/15043000
broad match: http://cv.iptc.org/newscodes/mediatopic/20001060