30 km stile libero
type: Concept
preferred label: 30 km estilo livre @pt-pt
preferred label: 30 km libre @fr
preferred label: 30 km Freistil @de
preferred label: ３０ｋｍフリースタイル @ja-jp
preferred label: 30 km estilo libre @es
preferred label: 30km free style @en-gb
definition: 30kmのフリースタイル・レース。最も一般的なスタイルで、競技者が滑走するスケートスタイル。スキー板を平行にする必要はない @ja-jp
definition: Corrida de 30km de estilo livre em que o estilo mais comum é o de patinagem (os esquiadores deslizam e os esquis não precisam de estar paralelos). @pt-pt
definition: 30 km Rennen im Freistil, bei dem der meist verwendete Stil das Skating ist, bei dem die Wettkämpfer gleiten und die Skier nicht parallel führen müssen. @de
definition: course de 30km style libre : tous les pas sont permis, le plus utilisé étant le pas du patineur dans lequel le skieur se laisse glisser sur ses skis qui ne sont plus parallèles @fr
definition: Corsa di 30 km in stile libero in cui lo stile più comune è quello del pattinaggio, gli sciatori procedono scivolando e non obbligatoriamente con gli sci paralleli
definition: A 30km free-style race where the most common style is the skate style where competitors slide and the skis do not need to be parallel @en-gb
definition: Corrida de 30km de estilo livre em que o estilo mais comum é o de patinação (os esquiadores deslizam e os esquis não precisam de estar paralelos). @pt-br
definition: Carrera de 30 Km. de estilo libre, donde se permiten todos los pasos y en la cual se emplea comúnmente el estilo de patinaje, con el que los competidores se dejan deslizar en el descenso sin necesidad de mantener los esquíes paralelos. @es
note: nessuno
in scheme: subjectcode
created: 2000-10-30T12:00:00+00:00
modified: 2010-12-15T17:01:09+00:00
broader: http://cv.iptc.org/newscodes/subjectcode/15043000
broad match: http://cv.iptc.org/newscodes/mediatopic/20001060