1,5 km sprint
type: Concept
preferred label: 1.5 km sprint @pt-br
preferred label: 1.5 km sprint free @en-gb
preferred label: 1.5 km style libre @fr
preferred label: １．５ｋｍスプリント @ja-jp
preferred label: campo traviesa 1,5 km. embalaje libre @es
preferred label: 1.5 km Sprint Freistil @de
definition: Cross-country skiing over a 1.5km course in a sprint format @en-gb
definition: course de 1,5km style libre tous les pas sont permis @fr
definition: Esquí de fondo a lo largo de una pista de 1,5 Km. en formato de embalaje libre. @es
definition: Langlauf über 1,5 km als Sprint. @de
definition: *Corrida de 1.5km de esqui de fundo em formato de **sprint**.* @pt-pt
definition: スプリント形式の1.5Kコースのクロスカントリースキー @ja-jp
definition: Gara di sci di fondo in velocità su un percorso di 1,5 km
note: nessuno
in scheme: subjectcode
created: 2000-10-30T12:00:00+00:00
modified: 2010-12-15T17:01:09+00:00
broader: http://cv.iptc.org/newscodes/subjectcode/15043000
broad match: http://cv.iptc.org/newscodes/mediatopic/20001060