Motonautica
type: Concept
preferred label: motonáutica @es
preferred label: モーターボート @ja-jp
preferred label: Motorbootsport @de
preferred label: Motonautisme @fr
preferred label: power boating @en-gb
definition: Les courses entre les embarcations motorisées en mer, sur rivière ou sur lac. @fr
definition: Rennen zwischen Motorbooten auf Flüssen oder Seen. @de
definition: Corridas de barcos a motor em rios ou lagos. @pt-br
definition: 川や湖でのモーターボートレース @ja-jp
definition: Carreras entre motos de agua en el mar, ríos o lagos. @es
definition: Gara tra barche a motore
definition: Races between motor boats on rivers or lakes @en-gb
note: nessuno
in scheme: subjectcode
created: 2000-10-30T12:00:00+00:00
modified: 2010-12-15T17:01:09+00:00
broader: http://cv.iptc.org/newscodes/subjectcode/15000000
narrower: http://cv.iptc.org/newscodes/subjectcode/15046001
narrower: http://cv.iptc.org/newscodes/subjectcode/15046002