F2
type: Concept
preferred label: Ｆ２ @ja-jp
preferred label: f2 @es
definition: Gara di velocità tra barche a motore
definition: Carreras de larga resistencia y distancia en motonaútica. @es
definition: Long distance race @en-gb
definition: Corrida de fundo. @pt-pt
definition: Langstrecken-Rennen. @de
definition: épreuve d'endurance @fr
definition: 長距離レース @ja-jp
note: nessuno
in scheme: subjectcode
created: 2000-10-30T12:00:00+00:00
modified: 2010-12-15T17:01:09+00:00
broader: http://cv.iptc.org/newscodes/subjectcode/15046000
broad match: http://cv.iptc.org/newscodes/mediatopic/20001016