Canottaggio
type: Concept
preferred label: ボート @ja-jp
preferred label: remo @pt-br
preferred label: Aviron @fr
preferred label: Rudern @de
preferred label: rowing @en-gb
definition: sport de glisse qui se déroule sur un plan d'eau, de préférence sans vent et sans courant dans des embarcations de 1, 2, 4 ou 8 rameurs. @fr
definition: Carrera de botes, usualmente en aguas tranquilas y calmas, con embarcaciones de 1, 2, 4 u 8 remeros. @es
definition: Corrida de barcos em águas calmas com embarcações de 1, 2, 4 ou 8 remadores. @pt-pt
definition: Gara su fiumi o laghi con barche per 1, 2, 4, o 8 rematori
definition: Bootsrennen meist in flachen ruhigen Gewässern mit Booten für 1,2,4,oder 8 Ruderern. @de
definition: Boat racing usually on flat calm waters with boats for 1, 2, 4 or 8 rowers @en-gb
definition: 通常は平たんで静かな水面で、1人、2人、4人、または8人のこぎ手によるボートレース @ja-jp
note: nessuno
in scheme: subjectcode
created: 2000-10-30T12:00:00+00:00
modified: 2010-12-15T17:01:09+00:00
broader: http://cv.iptc.org/newscodes/subjectcode/15000000
narrower: http://cv.iptc.org/newscodes/subjectcode/15047001
narrower: http://cv.iptc.org/newscodes/subjectcode/15047002
narrower: http://cv.iptc.org/newscodes/subjectcode/15047003
narrower: http://cv.iptc.org/newscodes/subjectcode/15047004
narrower: http://cv.iptc.org/newscodes/subjectcode/15047005
narrower: http://cv.iptc.org/newscodes/subjectcode/15047006
narrower: http://cv.iptc.org/newscodes/subjectcode/15047007