rúgbi
type: Concept
preferred label: rugby union @en-gb
preferred label: Rugby Union @de
preferred label: râguebi
preferred label: unión de rugby (rugby 15) @es
preferred label: ラグビー @ja-jp
preferred label: Union rugby @it
preferred label: Rugby à XV @fr
definition: Two teams of 15 compete on a pitch where they score tries and penalties by running with and passing an oval ball to be touched down behind the goal line or kicked between goal posts in a tough physical contest @en-gb
definition: Dos equipos de 15 jugadores compiten en una cancha de césped durante dos tiempos, anotando tries, conversiones y penales, corriendo y pasándose un balón ovalado, que debe ser apoyado detrás de la línea de anotación, o pateado entre los postes. @es
definition: Zwei Teams mit je 15 Spielern kämpfen um Punktabstand, indem sie Versuche und Strafpunkte bekommen durch Rennen und werfen eines ovalen Balles, der hinter der Torlinie den Boden berühren muss oder zwischen zwei Torpfosten geschossen wird in einem harten körperlichen Wettkampf. @de
definition: Jogo de bola em campo gramado opondo duas equipes de 15 jogadores, que tentam marcar ensaios e penalidades correndo e passando uma bola oval com as mãos e os pés.
definition: Due squadre, composta ciascuna da 15 giocatori, competono su un campo dove segnano punti e penalità correndo con una palla ovale che si passano e devono farla toccare a terra nell'area di meta avversaria o calciata tra i pali della porta @it
definition: Jogo de bola em campo relvado opondo duas equipas de 15 jogadores, que tentam marcar ensaios e penalidades correndo e passando uma bola oval com as mãos e os pés.
definition: Deux équipes de 15 joueurs essaient de marquer le plus d'essais et de pénalités possibles en portant, passant ou bottant un ballon ovale. @fr
definition: 15人からなる2つのチームがピッチで競い、選手は楕円形のボールをパスしながら走り、ゴールラインの後ろでタッチダウンするか、相手のペナルティで得点するか、またはボールをキックしてゴールポストの間を通過させることで得点する、屈強な肉体競技 @ja-jp
note: nessuno @it
in scheme: subjectcode
created: 2000-10-30T12:00:00+00:00
modified: 2010-12-15T17:01:09+00:00
broader: http://cv.iptc.org/newscodes/subjectcode/15000000
narrower: http://cv.iptc.org/newscodes/subjectcode/15049001