vela
type: Concept
preferred label: ヨット @ja-jp
preferred label: Voile @fr
preferred label: sailing @en-gb
preferred label: Vela @it
preferred label: Segeln @de
definition: Corrida de barcos a vela em percurso assinalado com boias.
definition: Corrida de barcos à vela em percurso assinalado com boias.
definition: Segelboot Rennen auf einer Rute die durch Bojen gekennzeichnet ist. @de
definition: ブイでマークされたルートを廻る帆船競技 @ja-jp
definition: Carrera de barcos de vela, sobre una ruta marcada por boyas. @es
definition: Regate di barche a vela lungo un percorso segnato da boe @it
definition: Sail boat racing over a route marked by buoys. @en-gb
definition: compétitition consistant à parcourir une distance donnée dans un minimum de temps avec un voilier @fr
note: nessuno @it
note: typo fixed in Explanation @en-gb
in scheme: subjectcode
created: 2000-10-30T12:00:00+00:00
modified: 2010-12-15T17:01:09+00:00
broader: http://cv.iptc.org/newscodes/subjectcode/15000000
narrower: http://cv.iptc.org/newscodes/subjectcode/15050001
narrower: http://cv.iptc.org/newscodes/subjectcode/15050002
narrower: http://cv.iptc.org/newscodes/subjectcode/15050003
narrower: http://cv.iptc.org/newscodes/subjectcode/15050004
narrower: http://cv.iptc.org/newscodes/subjectcode/15050005
narrower: http://cv.iptc.org/newscodes/subjectcode/15050006
narrower: http://cv.iptc.org/newscodes/subjectcode/15050007
narrower: http://cv.iptc.org/newscodes/subjectcode/15050008
narrower: http://cv.iptc.org/newscodes/subjectcode/15050009
narrower: http://cv.iptc.org/newscodes/subjectcode/15050010
narrower: http://cv.iptc.org/newscodes/subjectcode/15050011
narrower: http://cv.iptc.org/newscodes/subjectcode/15050012
narrower: http://cv.iptc.org/newscodes/subjectcode/15050013
narrower: http://cv.iptc.org/newscodes/subjectcode/15050014
narrower: http://cv.iptc.org/newscodes/subjectcode/15050015
narrower: http://cv.iptc.org/newscodes/subjectcode/15050016