49 er
type: Concept
preferred label: 49er @fr
preferred label: ４９ｅｒ級 @ja-jp
definition: Bootskategorie: zwei-Männer Dinghy (8.23/ Hauptsegel). Olympische Disziplin. @de
definition: Categoria de embarcação: dinghy de 2 tripulantes (8.23m quadrados vela grande). Desporto olímpico. @pt-br
definition: Deriva olimpica per due persone (randa 8,23 mq)
definition: ヨット・カテゴリ:2人乗り競走用小型ヨット(8.23平方メートル主帆)オリンピック・スポーツ @ja-jp
definition: catégorie d'embarcation : dériveur à deux équipiers @fr
definition: Boat Category: two man dinghy (8.23m/sq mainsail) Olympic sport @en-gb
definition: Categoría de embarcación: Para dos hombres con vela mayor. Deporte Olímpico. @es
note: nessuno
in scheme: subjectcode
created: 2000-10-30T12:00:00+00:00
modified: 2010-12-15T17:01:09+00:00
broad match: http://cv.iptc.org/newscodes/mediatopic/20001040
broader: http://cv.iptc.org/newscodes/subjectcode/15050000