10 m pistola ad aria
type: Concept
preferred label: 10 m pistola de aire comprimido @es
preferred label: Pistolet à air comprimé à 10 m @fr
preferred label: pistola 10 m @pt-br
preferred label: １０ｍエアピストル @ja-jp
preferred label: 10 m air pistol @en-gb
preferred label: 10 m Luftpistole @de
definition: Prueba de tiro. @es
definition: 射撃競技 @ja-jp
definition: Shooting event @en-gb
definition: Schießwettkampf. @de
definition: Prova de tiro @pt-br
definition: Gara di tiro a segno su 10 m con pistola
definition: discipline du tir @fr
note: nessuno
in scheme: subjectcode
created: 2000-10-30T12:00:00+00:00
modified: 2010-12-15T17:01:09+00:00
broad match: http://cv.iptc.org/newscodes/mediatopic/20001050
broader: http://cv.iptc.org/newscodes/subjectcode/15051000