10 m bersaglio mobile
type: Concept
preferred label: 10 m Laufende Scheibe @de
preferred label: 10 m running target @en-gb
preferred label: 10 m cible mouvante @fr
preferred label: 10 m blanco en movimiento @es
preferred label: alvo móvel 10 m @pt-pt
preferred label: １０ｍランニングターゲット @ja-jp
definition: Prueba de tiro. @es
definition: Schießwettkampf. @de
definition: Gara di tiro a segno sui 10 m con sagoma a scomparsa
definition: Prova de tiro @pt-br
definition: Shooting event @en-gb
definition: 射撃競技 @ja-jp
definition: discipline du tir @fr
note: nessuno
in scheme: subjectcode
created: 2000-10-30T12:00:00+00:00
modified: 2010-12-15T17:01:09+00:00
broad match: http://cv.iptc.org/newscodes/mediatopic/20001052
broader: http://cv.iptc.org/newscodes/subjectcode/15051000